Il y a actuellement 55 visiteurs
Mardi 17 Septembre 2019
accueilactualitésdossierscomparer les prixtélécharger gratuitement vos logicielsoffres d'emploiforum informatique
Connexion
Créer un compte

Installation de cxfreeze

L'informatique, ce n'est pas qu'un PC équipé de Windows. Ce forum est dédié aux utilisateurs de systèmes d'exploitation dérivés d'unix (GNU/Linux, *BSD, etc...) et aux autres OS alternatifs.

Installation de cxfreeze

Message le 03 Aoû 2018 15:35

Bonjour j'essaye d'installer cxfreeze permettant de générer un fichier exécutable et portable sur Window et linux à partir d'un fichier python.

J'ai donc téléchargé cxfreeze via cette page web : https://sourceforge.net/projects/cx-fre ... p_redirect

J'ai décompressé l'archive et appliqué les instructions d'installations. Cependant en tapant la commande : python setup.py build

J'ai une erreur qui survient et donc il m'est impossible de l'installer.

Erreur :

python setup.py build
Traceback (most recent call last):
File "setup.py", line 138, in <module>
finder = cx_Freeze.ModuleFinder(bootstrap = True)
File "/home/calbert/Téléchargements/cx_Freeze-4.3.3/cx_Freeze/finder.py", line 160, in __init__
self._AddBaseModules()
File "/home/calbert/Téléchargements/cx_Freeze-4.3.3/cx_Freeze/finder.py", line 187, in _AddBaseModules
self.IncludeModule("traceback")
File "/home/calbert/Téléchargements/cx_Freeze-4.3.3/cx_Freeze/finder.py", line 678, in IncludeModule
namespace = namespace)
File "/home/calbert/Téléchargements/cx_Freeze-4.3.3/cx_Freeze/finder.py", line 346, in _ImportModule
deferredImports, namespace = namespace)
File "/home/calbert/Téléchargements/cx_Freeze-4.3.3/cx_Freeze/finder.py", line 436, in _InternalImportModule
parentModule, namespace)
File "/home/calbert/Téléchargements/cx_Freeze-4.3.3/cx_Freeze/finder.py", line 502, in _LoadModule
self._ScanCode(module.code, module, deferredImports)
File "/home/calbert/Téléchargements/cx_Freeze-4.3.3/cx_Freeze/finder.py", line 588, in _ScanCode
arguments.append(co.co_consts[opArg])
IndexError: tuple index out of range

Merci de votre aide. J'avoue que j'ai toujours un peu de mal d'installer des programmes sur linux :)
sim4bel
Sous Expert(e)
Sous Expert(e)
 
Messages: 98
Inscription: 14 Aoû 2014 12:34
 


Re: Installation de cxfreeze

Message le 04 Aoû 2018 10:57

Bonjour,

Je ne connais strictement rien en python, et pas grand chose en Linux, mais j'ai vu que sur le site de l'application cx-Freeze, ils donnent comme instruction d'installation :
python -m pip install cx_Freeze --upgrade

(source : https://anthony-tuininga.github.io/cx_Freeze/)
No hay camino. Se hace camino al andar. (A. Machado)
Avatar de l'utilisateur
diogene
Moderateur
Moderateur
 
Messages: 10597
Inscription: 24 Avr 2009 23:41
Localisation: Dordogne
 

Re: Installation de cxfreeze

Message le 04 Aoû 2018 11:31

Merci Diogene, en effet, cependant en effectuant cette commande une erreur survient aussi :
Failed building wheel for cx-Freeze

Command "/home/calbert/anaconda3/bin/python -u -c "import setuptools, tokenize;__file__='/tmp/pip-install-tfcs1j4u/cx-Freeze/setup.py';f=getattr(tokenize, 'open', open)(__file__);code=f.read().replace('\r\n', '\n');f.close();exec(compile(code, __file__, 'exec'))" install --record /tmp/pip-record-_932r_ky/install-record.txt --single-version-externally-managed --compile" failed with error code 1 in /tmp/pip-install-tfcs1j4u/cx-Freeze/

Je place le détail complet au cas ou (moi je n'y comprends pas grand chôse) :

python -m pip install cx_Freeze --upgrade
Collecting cx_Freeze
Using cached https://files.pythonhosted.org/packages ... 1.1.tar.gz
Building wheels for collected packages: cx-Freeze
Running setup.py bdist_wheel for cx-Freeze ... error
Complete output from command /home/calbert/anaconda3/bin/python -u -c "import setuptools, tokenize;__file__='/tmp/pip-install-tfcs1j4u/cx-Freeze/setup.py';f=getattr(tokenize, 'open', open)(__file__);code=f.read().replace('\r\n', '\n');f.close();exec(compile(code, __file__, 'exec'))" bdist_wheel -d /tmp/pip-wheel-ua2e_2qk --python-tag cp36:
running bdist_wheel
running build
running build_py
creating build
creating build/lib.linux-x86_64-3.6
creating build/lib.linux-x86_64-3.6/cx_Freeze
copying cx_Freeze/dist.py -> build/lib.linux-x86_64-3.6/cx_Freeze
copying cx_Freeze/common.py -> build/lib.linux-x86_64-3.6/cx_Freeze
copying cx_Freeze/__init__.py -> build/lib.linux-x86_64-3.6/cx_Freeze
copying cx_Freeze/windist.py -> build/lib.linux-x86_64-3.6/cx_Freeze
copying cx_Freeze/hooks.py -> build/lib.linux-x86_64-3.6/cx_Freeze
copying cx_Freeze/macdist.py -> build/lib.linux-x86_64-3.6/cx_Freeze
copying cx_Freeze/finder.py -> build/lib.linux-x86_64-3.6/cx_Freeze
copying cx_Freeze/main.py -> build/lib.linux-x86_64-3.6/cx_Freeze
copying cx_Freeze/freezer.py -> build/lib.linux-x86_64-3.6/cx_Freeze
copying cx_Freeze/setupwriter.py -> build/lib.linux-x86_64-3.6/cx_Freeze
creating build/lib.linux-x86_64-3.6/cx_Freeze/initscripts
copying cx_Freeze/initscripts/SharedLibSource.py -> build/lib.linux-x86_64-3.6/cx_Freeze/initscripts
copying cx_Freeze/initscripts/Console.py -> build/lib.linux-x86_64-3.6/cx_Freeze/initscripts
copying cx_Freeze/initscripts/__startup__.py -> build/lib.linux-x86_64-3.6/cx_Freeze/initscripts
copying cx_Freeze/initscripts/SharedLib.py -> build/lib.linux-x86_64-3.6/cx_Freeze/initscripts
copying cx_Freeze/initscripts/ConsoleSetLibPath.py -> build/lib.linux-x86_64-3.6/cx_Freeze/initscripts
creating build/lib.linux-x86_64-3.6/cx_Freeze/samples
creating build/lib.linux-x86_64-3.6/cx_Freeze/samples/Tkinter
copying cx_Freeze/samples/Tkinter/setup.py -> build/lib.linux-x86_64-3.6/cx_Freeze/samples/Tkinter
copying cx_Freeze/samples/Tkinter/SimpleTkApp.py -> build/lib.linux-x86_64-3.6/cx_Freeze/samples/Tkinter
creating build/lib.linux-x86_64-3.6/cx_Freeze/samples/matplotlib
copying cx_Freeze/samples/matplotlib/setup.py -> build/lib.linux-x86_64-3.6/cx_Freeze/samples/matplotlib
copying cx_Freeze/samples/matplotlib/matplotlib_eg.py -> build/lib.linux-x86_64-3.6/cx_Freeze/samples/matplotlib
creating build/lib.linux-x86_64-3.6/cx_Freeze/samples/relimport
copying cx_Freeze/samples/relimport/setup.py -> build/lib.linux-x86_64-3.6/cx_Freeze/samples/relimport
copying cx_Freeze/samples/relimport/relimport.py -> build/lib.linux-x86_64-3.6/cx_Freeze/samples/relimport
creating build/lib.linux-x86_64-3.6/cx_Freeze/samples/asmodule
copying cx_Freeze/samples/asmodule/asmodule.py -> build/lib.linux-x86_64-3.6/cx_Freeze/samples/asmodule
copying cx_Freeze/samples/asmodule/setup.py -> build/lib.linux-x86_64-3.6/cx_Freeze/samples/asmodule
creating build/lib.linux-x86_64-3.6/cx_Freeze/samples/simple
copying cx_Freeze/samples/simple/setup.py -> build/lib.linux-x86_64-3.6/cx_Freeze/samples/simple
copying cx_Freeze/samples/simple/hello.py -> build/lib.linux-x86_64-3.6/cx_Freeze/samples/simple
creating build/lib.linux-x86_64-3.6/cx_Freeze/samples/wx
copying cx_Freeze/samples/wx/wxapp.py -> build/lib.linux-x86_64-3.6/cx_Freeze/samples/wx
copying cx_Freeze/samples/wx/setup.py -> build/lib.linux-x86_64-3.6/cx_Freeze/samples/wx
creating build/lib.linux-x86_64-3.6/cx_Freeze/samples/advanced
copying cx_Freeze/samples/advanced/advanced_1.py -> build/lib.linux-x86_64-3.6/cx_Freeze/samples/advanced
copying cx_Freeze/samples/advanced/setup.py -> build/lib.linux-x86_64-3.6/cx_Freeze/samples/advanced
copying cx_Freeze/samples/advanced/advanced_2.py -> build/lib.linux-x86_64-3.6/cx_Freeze/samples/advanced
creating build/lib.linux-x86_64-3.6/cx_Freeze/samples/zope
copying cx_Freeze/samples/zope/setup.py -> build/lib.linux-x86_64-3.6/cx_Freeze/samples/zope
copying cx_Freeze/samples/zope/qotd.py -> build/lib.linux-x86_64-3.6/cx_Freeze/samples/zope
creating build/lib.linux-x86_64-3.6/cx_Freeze/samples/openpyxl
copying cx_Freeze/samples/openpyxl/setup.py -> build/lib.linux-x86_64-3.6/cx_Freeze/samples/openpyxl
copying cx_Freeze/samples/openpyxl/test_openpyxl.py -> build/lib.linux-x86_64-3.6/cx_Freeze/samples/openpyxl
creating build/lib.linux-x86_64-3.6/cx_Freeze/samples/PyQt5
copying cx_Freeze/samples/PyQt5/PyQt5app.py -> build/lib.linux-x86_64-3.6/cx_Freeze/samples/PyQt5
copying cx_Freeze/samples/PyQt5/setup.py -> build/lib.linux-x86_64-3.6/cx_Freeze/samples/PyQt5
creating build/lib.linux-x86_64-3.6/cx_Freeze/samples/PyQt4
copying cx_Freeze/samples/PyQt4/PyQt4app.py -> build/lib.linux-x86_64-3.6/cx_Freeze/samples/PyQt4
copying cx_Freeze/samples/PyQt4/setup.py -> build/lib.linux-x86_64-3.6/cx_Freeze/samples/PyQt4
creating build/lib.linux-x86_64-3.6/cx_Freeze/samples/service
copying cx_Freeze/samples/service/ServiceHandler.py -> build/lib.linux-x86_64-3.6/cx_Freeze/samples/service
copying cx_Freeze/samples/service/Config.py -> build/lib.linux-x86_64-3.6/cx_Freeze/samples/service
copying cx_Freeze/samples/service/setup.py -> build/lib.linux-x86_64-3.6/cx_Freeze/samples/service
running build_ext
building 'cx_Freeze.util' extension
creating build/temp.linux-x86_64-3.6
creating build/temp.linux-x86_64-3.6/source
gcc -pthread -B /home/calbert/anaconda3/compiler_compat -Wsign-compare -DNDEBUG -g -fwrapv -O3 -Wall -Wstrict-prototypes -fPIC -I/home/calbert/anaconda3/include/python3.6m -c source/util.c -o build/temp.linux-x86_64-3.6/source/util.o
gcc -pthread -shared -B /home/calbert/anaconda3/compiler_compat -L/home/calbert/anaconda3/lib -Wl,-rpath=/home/calbert/anaconda3/lib,--no-as-needed build/temp.linux-x86_64-3.6/source/util.o -L/home/calbert/anaconda3/lib -lpython3.6m -o build/lib.linux-x86_64-3.6/cx_Freeze/util.cpython-36m-x86_64-linux-gnu.so
creating build/temp.linux-x86_64-3.6/source/bases
gcc -pthread -B /home/calbert/anaconda3/compiler_compat -Wsign-compare -DNDEBUG -g -fwrapv -O3 -Wall -Wstrict-prototypes -fPIC -I/home/calbert/anaconda3/include/python3.6m -c source/bases/Console.c -o build/temp.linux-x86_64-3.6/source/bases/Console.o
creating build/lib.linux-x86_64-3.6/cx_Freeze/bases
gcc -pthread -B /home/calbert/anaconda3/compiler_compat build/temp.linux-x86_64-3.6/source/bases/Console.o -L/home/calbert/anaconda3/lib/python3.6/config-3.6m-x86_64-linux-gnu -L/home/calbert/anaconda3/lib -lpython3.6m -lpython3.6m -o build/lib.linux-x86_64-3.6/cx_Freeze/bases/Console -Xlinker -export-dynamic -lpthread -ldl -lutil -lrt -lm -s
lto1: fatal error: bytecode stream generated with LTO version 6.0 instead of the expected 4.1
compilation terminated.
lto-wrapper: fatal error: gcc returned 1 exit status
compilation terminated.
/home/calbert/anaconda3/compiler_compat/ld: error: lto-wrapper failed
collect2: error: ld returned 1 exit status
error: command 'gcc' failed with exit status 1

----------------------------------------
Failed building wheel for cx-Freeze
Running setup.py clean for cx-Freeze
Failed to build cx-Freeze
Installing collected packages: cx-Freeze
Running setup.py install for cx-Freeze ... error
Complete output from command /home/calbert/anaconda3/bin/python -u -c "import setuptools, tokenize;__file__='/tmp/pip-install-tfcs1j4u/cx-Freeze/setup.py';f=getattr(tokenize, 'open', open)(__file__);code=f.read().replace('\r\n', '\n');f.close();exec(compile(code, __file__, 'exec'))" install --record /tmp/pip-record-_932r_ky/install-record.txt --single-version-externally-managed --compile:
running install
running build
running build_py
creating build
creating build/lib.linux-x86_64-3.6
creating build/lib.linux-x86_64-3.6/cx_Freeze
copying cx_Freeze/dist.py -> build/lib.linux-x86_64-3.6/cx_Freeze
copying cx_Freeze/common.py -> build/lib.linux-x86_64-3.6/cx_Freeze
copying cx_Freeze/__init__.py -> build/lib.linux-x86_64-3.6/cx_Freeze
copying cx_Freeze/windist.py -> build/lib.linux-x86_64-3.6/cx_Freeze
copying cx_Freeze/hooks.py -> build/lib.linux-x86_64-3.6/cx_Freeze
copying cx_Freeze/macdist.py -> build/lib.linux-x86_64-3.6/cx_Freeze
copying cx_Freeze/finder.py -> build/lib.linux-x86_64-3.6/cx_Freeze
copying cx_Freeze/main.py -> build/lib.linux-x86_64-3.6/cx_Freeze
copying cx_Freeze/freezer.py -> build/lib.linux-x86_64-3.6/cx_Freeze
copying cx_Freeze/setupwriter.py -> build/lib.linux-x86_64-3.6/cx_Freeze
creating build/lib.linux-x86_64-3.6/cx_Freeze/initscripts
copying cx_Freeze/initscripts/SharedLibSource.py -> build/lib.linux-x86_64-3.6/cx_Freeze/initscripts
copying cx_Freeze/initscripts/Console.py -> build/lib.linux-x86_64-3.6/cx_Freeze/initscripts
copying cx_Freeze/initscripts/__startup__.py -> build/lib.linux-x86_64-3.6/cx_Freeze/initscripts
copying cx_Freeze/initscripts/SharedLib.py -> build/lib.linux-x86_64-3.6/cx_Freeze/initscripts
copying cx_Freeze/initscripts/ConsoleSetLibPath.py -> build/lib.linux-x86_64-3.6/cx_Freeze/initscripts
creating build/lib.linux-x86_64-3.6/cx_Freeze/samples
creating build/lib.linux-x86_64-3.6/cx_Freeze/samples/Tkinter
copying cx_Freeze/samples/Tkinter/setup.py -> build/lib.linux-x86_64-3.6/cx_Freeze/samples/Tkinter
copying cx_Freeze/samples/Tkinter/SimpleTkApp.py -> build/lib.linux-x86_64-3.6/cx_Freeze/samples/Tkinter
creating build/lib.linux-x86_64-3.6/cx_Freeze/samples/matplotlib
copying cx_Freeze/samples/matplotlib/setup.py -> build/lib.linux-x86_64-3.6/cx_Freeze/samples/matplotlib
copying cx_Freeze/samples/matplotlib/matplotlib_eg.py -> build/lib.linux-x86_64-3.6/cx_Freeze/samples/matplotlib
creating build/lib.linux-x86_64-3.6/cx_Freeze/samples/relimport
copying cx_Freeze/samples/relimport/setup.py -> build/lib.linux-x86_64-3.6/cx_Freeze/samples/relimport
copying cx_Freeze/samples/relimport/relimport.py -> build/lib.linux-x86_64-3.6/cx_Freeze/samples/relimport
creating build/lib.linux-x86_64-3.6/cx_Freeze/samples/asmodule
copying cx_Freeze/samples/asmodule/asmodule.py -> build/lib.linux-x86_64-3.6/cx_Freeze/samples/asmodule
copying cx_Freeze/samples/asmodule/setup.py -> build/lib.linux-x86_64-3.6/cx_Freeze/samples/asmodule
creating build/lib.linux-x86_64-3.6/cx_Freeze/samples/simple
copying cx_Freeze/samples/simple/setup.py -> build/lib.linux-x86_64-3.6/cx_Freeze/samples/simple
copying cx_Freeze/samples/simple/hello.py -> build/lib.linux-x86_64-3.6/cx_Freeze/samples/simple
creating build/lib.linux-x86_64-3.6/cx_Freeze/samples/wx
copying cx_Freeze/samples/wx/wxapp.py -> build/lib.linux-x86_64-3.6/cx_Freeze/samples/wx
copying cx_Freeze/samples/wx/setup.py -> build/lib.linux-x86_64-3.6/cx_Freeze/samples/wx
creating build/lib.linux-x86_64-3.6/cx_Freeze/samples/advanced
copying cx_Freeze/samples/advanced/advanced_1.py -> build/lib.linux-x86_64-3.6/cx_Freeze/samples/advanced
copying cx_Freeze/samples/advanced/setup.py -> build/lib.linux-x86_64-3.6/cx_Freeze/samples/advanced
copying cx_Freeze/samples/advanced/advanced_2.py -> build/lib.linux-x86_64-3.6/cx_Freeze/samples/advanced
creating build/lib.linux-x86_64-3.6/cx_Freeze/samples/zope
copying cx_Freeze/samples/zope/setup.py -> build/lib.linux-x86_64-3.6/cx_Freeze/samples/zope
copying cx_Freeze/samples/zope/qotd.py -> build/lib.linux-x86_64-3.6/cx_Freeze/samples/zope
creating build/lib.linux-x86_64-3.6/cx_Freeze/samples/openpyxl
copying cx_Freeze/samples/openpyxl/setup.py -> build/lib.linux-x86_64-3.6/cx_Freeze/samples/openpyxl
copying cx_Freeze/samples/openpyxl/test_openpyxl.py -> build/lib.linux-x86_64-3.6/cx_Freeze/samples/openpyxl
creating build/lib.linux-x86_64-3.6/cx_Freeze/samples/PyQt5
copying cx_Freeze/samples/PyQt5/PyQt5app.py -> build/lib.linux-x86_64-3.6/cx_Freeze/samples/PyQt5
copying cx_Freeze/samples/PyQt5/setup.py -> build/lib.linux-x86_64-3.6/cx_Freeze/samples/PyQt5
creating build/lib.linux-x86_64-3.6/cx_Freeze/samples/PyQt4
copying cx_Freeze/samples/PyQt4/PyQt4app.py -> build/lib.linux-x86_64-3.6/cx_Freeze/samples/PyQt4
copying cx_Freeze/samples/PyQt4/setup.py -> build/lib.linux-x86_64-3.6/cx_Freeze/samples/PyQt4
creating build/lib.linux-x86_64-3.6/cx_Freeze/samples/service
copying cx_Freeze/samples/service/ServiceHandler.py -> build/lib.linux-x86_64-3.6/cx_Freeze/samples/service
copying cx_Freeze/samples/service/Config.py -> build/lib.linux-x86_64-3.6/cx_Freeze/samples/service
copying cx_Freeze/samples/service/setup.py -> build/lib.linux-x86_64-3.6/cx_Freeze/samples/service
running build_ext
building 'cx_Freeze.util' extension
creating build/temp.linux-x86_64-3.6
creating build/temp.linux-x86_64-3.6/source
gcc -pthread -B /home/calbert/anaconda3/compiler_compat -Wsign-compare -DNDEBUG -g -fwrapv -O3 -Wall -Wstrict-prototypes -fPIC -I/home/calbert/anaconda3/include/python3.6m -c source/util.c -o build/temp.linux-x86_64-3.6/source/util.o
gcc -pthread -shared -B /home/calbert/anaconda3/compiler_compat -L/home/calbert/anaconda3/lib -Wl,-rpath=/home/calbert/anaconda3/lib,--no-as-needed build/temp.linux-x86_64-3.6/source/util.o -L/home/calbert/anaconda3/lib -lpython3.6m -o build/lib.linux-x86_64-3.6/cx_Freeze/util.cpython-36m-x86_64-linux-gnu.so
creating build/temp.linux-x86_64-3.6/source/bases
gcc -pthread -B /home/calbert/anaconda3/compiler_compat -Wsign-compare -DNDEBUG -g -fwrapv -O3 -Wall -Wstrict-prototypes -fPIC -I/home/calbert/anaconda3/include/python3.6m -c source/bases/Console.c -o build/temp.linux-x86_64-3.6/source/bases/Console.o
creating build/lib.linux-x86_64-3.6/cx_Freeze/bases
gcc -pthread -B /home/calbert/anaconda3/compiler_compat build/temp.linux-x86_64-3.6/source/bases/Console.o -L/home/calbert/anaconda3/lib/python3.6/config-3.6m-x86_64-linux-gnu -L/home/calbert/anaconda3/lib -lpython3.6m -lpython3.6m -o build/lib.linux-x86_64-3.6/cx_Freeze/bases/Console -Xlinker -export-dynamic -lpthread -ldl -lutil -lrt -lm -s
lto1: fatal error: bytecode stream generated with LTO version 6.0 instead of the expected 4.1
compilation terminated.
lto-wrapper: fatal error: gcc returned 1 exit status
compilation terminated.
/home/calbert/anaconda3/compiler_compat/ld: error: lto-wrapper failed
collect2: error: ld returned 1 exit status
error: command 'gcc' failed with exit status 1

----------------------------------------
Command "/home/calbert/anaconda3/bin/python -u -c "import setuptools, tokenize;__file__='/tmp/pip-install-tfcs1j4u/cx-Freeze/setup.py';f=getattr(tokenize, 'open', open)(__file__);code=f.read().replace('\r\n', '\n');f.close();exec(compile(code, __file__, 'exec'))" install --record /tmp/pip-record-_932r_ky/install-record.txt --single-version-externally-managed --compile" failed with error code 1 in /tmp/pip-install-tfcs1j4u/cx-Freeze/
sim4bel
Sous Expert(e)
Sous Expert(e)
 
Messages: 98
Inscription: 14 Aoû 2014 12:34
 

Re: Installation de cxfreeze

Message le 04 Aoû 2018 11:51

Là, ça outrepasse largement mes compétences. Le mieux est de t'adresser au développeur/mainteneur sur le site de l'application en lui contant tes tracas.

La ligne qui paraît importante :
lto1: fatal error: bytecode stream generated with LTO version 6.0 instead of the expected 4.1


Cela semble indiquer un conflit de version dans ton installation de python. Si tu fais une recherche avec cette ligne comme argument, tu trouves pas mal de réponses dans ce sens, mais je n'y comprends rien.
No hay camino. Se hace camino al andar. (A. Machado)
Avatar de l'utilisateur
diogene
Moderateur
Moderateur
 
Messages: 10597
Inscription: 24 Avr 2009 23:41
Localisation: Dordogne
 

Re: Installation de cxfreeze

Message le 14 Aoû 2018 13:41

Regarde par ici Frequently Asked Questions

Regarde du coté de Microsoft Visual C++ Redistributable Package sinon regarde la page depuis le début.
Ne pas faire demain ce que tu peux faire aujourd'hui !!!
Image
Avatar de l'utilisateur
webdesigner
PC-Infopraticien
PC-Infopraticien
 
Messages: 3028
Inscription: 13 Aoû 2008 14:46
Localisation: Vernou la Celle sur Seine
 



Sujets similaires

Message W7 ne peut pas terminer l'installation nouveau disque dur in
Bonjour voici mon souci mon ancien disque dur interne ordinateur Acer Aspire fonctionnant avec Windows 7 a lâché,j'en ai racheté un autre que j'ai installé j'ai refait une installation avec les 3 disques DVD de restauration ,tout se passe bien jusqu'à la fin de l'installation au moment où l'écran ...
Réponses: 8

Message Créer une clé usb d'installation de Windows 10 Pro
Salutations, tout d'abord j'espère ne pas m'être trompé de topic, pour ma demande d'aide de création de clé bootable.J'ai décidé de laisser tomber mon problème de cable usb avec mon autre pc, de toute façon j'ai racheté une carte mère identique, donc si le problème venait bien de la carte mère que j ...
Réponses: 6

Message [Réglé] Installation W10 erreur Driver PNP WATCHDOG
Hey ! bien le bonjour à vous.Comment allez-vous en ces vacances scolaire? Pour ma part, Egypte en septembre. Ont va ce déconnecter du monde binaire Dite moi, je suis sur un pc récup, carte mère MEDION avec un CPU AMD 6GO de Ram et un disque dur WDC 512GO en SATAJe souhaitais donc installé Win10 et ...
Réponses: 5

Message [Réglé]problème de boot pour installation de windows 10
Bonjour sur un pc portable Asus X751L, je suis en train de changer le disque dur (hs) pour un SSD, mais impossible de booter sur une clef ou un CD pour faire l'installation. Dans le Bios j'ai ça, pas de réglage possible... Une idée pour me sortir de ce mauvais pas svp ? Merci.
Réponses: 8

Message installation win7 impossible
bonjour a tousje possede un asus X93S , je viens de changer le disque dur pour mettre un SSD.je souhaite installer Win 7 mais après le redémarrage en fin d'installation j'ai un message d'erreur.photo en pièce jointemerci pour votre aide
Réponses: 2

Message Problème avec installation et désinstallation
Bonjourdepuis quelques jours toutes mes tentatives d'installer ou désinstaller des logiciels sur mon PC échouent: un message d'erreur annonce:"un autre installation est en cours d'exécution.Terminez celle-ci avant d'effectuer cette installation"Le gestionnaire des tâches ne montre aucune a ...
Réponses: 13

Message Installation en dual boat Windows 7 pro et Zorin OS
Bonsoir,J'ai fait une sauvegarde de mes données.1. Comment faire pour formater mon disque dur pour effacer proprement toutes les données ?[/list] 2. Comment installer en dual boot Windows 7 pro et une version Linux avec un environnement Windows Zorin OS 12.4 Core 32 bits téléchargé à partir du site ...
Réponses: 5


Qui est en ligne

Utilisateurs parcourant ce forum: Aucun utilisateur enregistré et 2 invités


.: Nous contacter :: Flux RSS :: Données personnelles :.